Target
N-formyl peptide receptor 2
Ligand
BDBM40408
Substrate
Meas. Tech.
Formylpeptide Receptor (FPR) Ligand Structure Activity Relationship (SAR) Analysis : Dose Response Assay Counterscreen Against Formyl Peptide Receptor-Like-1 (FPRL1)
Ki
>40300±n/a nM
Citation
 PubChem, PC Formylpeptide Receptor (FPR) Ligand Structure Activity Relationship (SAR) Analysis : Dose Response Assay Counterscreen Against Formyl Peptide Receptor-Like-1 (FPRL1)  PubChem Bioassay (2007)[AID] 
Target
Name:
N-formyl peptide receptor 2
Synonyms:
ALXR, FPRL1, FPR2 FPR2 FPRH1 Formyl Peptide Receptor-Like 1 LXA4 receptor Lipoxin A4 receptor RFP | hFPRL
Type:
G Protein-Coupled Receptor (GPCR)
Mol. Mass.:
38968.35
Organism:
Homo sapiens (Human)
Description:
P25090
Residue:
351
  
Inhibitor
Name:
BDBM40408
Synonyms:
(4E)-1-(3-chlorophenyl)-5-(2,4-dimethoxyphenyl)-4-[hydroxy(phenyl)methylene]pyrrolidine-2,3-quinone (4E)-1-(3-chlorophenyl)-5-(2,4-dimethoxyphenyl)-4-[oxidanyl(phenyl)methylidene]pyrrolidine-2,3-dione cid_5903206
Type:
Small organic molecule
Emp. Form.:
C25H20ClNO5
Mol. Mass.:
449.883
SMILES:
COc1ccc(C2C(C(=O)c3ccccc3)C(=O)C(=O)N2c2cccc(Cl)c2)c(OC)c1
: