Target
N-formyl peptide receptor 2
Ligand
BDBM40417
Substrate
Meas. Tech.
Formylpeptide Receptor (FPR) Ligand Structure Activity Relationship (SAR) Analysis : Dose Response Assay Counterscreen Against Formyl Peptide Receptor-Like-1 (FPRL1)
Ki
>40300±n/a nM
Citation
 PubChem, PC Formylpeptide Receptor (FPR) Ligand Structure Activity Relationship (SAR) Analysis : Dose Response Assay Counterscreen Against Formyl Peptide Receptor-Like-1 (FPRL1)  PubChem Bioassay (2007)[AID] 
Target
Name:
N-formyl peptide receptor 2
Synonyms:
ALXR, FPRL1, FPR2 FPR2 FPRH1 Formyl Peptide Receptor-Like 1 LXA4 receptor Lipoxin A4 receptor RFP | hFPRL
Type:
G Protein-Coupled Receptor (GPCR)
Mol. Mass.:
38968.35
Organism:
Homo sapiens (Human)
Description:
P25090
Residue:
351
  
Inhibitor
Name:
BDBM40417
Synonyms:
2-thiophenecarboxylic acid [3-(2-bromophenoxy)-4-oxo-2-(trifluoromethyl)-1-benzopyran-7-yl] ester [3-(2-bromanylphenoxy)-4-oxidanylidene-2-(trifluoromethyl)chromen-7-yl] thiophene-2-carboxylate cid_1591032 | thiophene-2-carboxylic acid [3-(2-bromophenoxy)-4-keto-2-(trifluoromethyl)chromen-7-yl] ester
Type:
Small organic molecule
Emp. Form.:
C21H10BrF3O5S
Mol. Mass.:
511.265
SMILES:
FC(F)(F)c1oc2cc(OC(=O)c3cccs3)ccc2c(=O)c1Oc1ccccc1Br
: