Target
N-formyl peptide receptor 2
Ligand
BDBM40746
Substrate
Meas. Tech.
Formylpeptide Receptor (FPRL1) Ligand Structure Activity Relationship (SAR) Analysis : Dose Response Assay
Ki
>34700±n/a nM
Citation
 PubChem, PC Formylpeptide Receptor (FPRL1) Ligand Structure Activity Relationship (SAR) Analysis : Dose Response Assay PubChem Bioassay (2007)[AID] 
Target
Name:
N-formyl peptide receptor 2
Synonyms:
ALXR, FPRL1, FPR2 FPR2 FPRH1 Formyl Peptide Receptor-Like 1 LXA4 receptor Lipoxin A4 receptor RFP | hFPRL
Type:
G Protein-Coupled Receptor (GPCR)
Mol. Mass.:
38968.35
Organism:
Homo sapiens (Human)
Description:
P25090
Residue:
351
  
Inhibitor
Name:
BDBM40746
Synonyms:
2,2,2-trifluoro-1-[4-(4-phenyl-2-quinazolinyl)-1-piperazinyl]ethanone 2,2,2-trifluoro-1-[4-(4-phenylquinazolin-2-yl)piperazino]ethanone UNM000003650701 | cid_1145410
Type:
Small organic molecule
Emp. Form.:
C20H17F3N4O
Mol. Mass.:
386.3704
SMILES:
FC(F)(F)C(=O)N1CCN(CC1)c1nc(-c2ccccc2)c2ccccc2n1
: