Target
Focal adhesion kinase 1
Ligand
BDBM40956
Substrate
Meas. Tech.
Dose-response biochemical assay for inhibitors of Focal Adhesion Kinase (FAK)
IC50
4261±n/a nM
Citation
 PubChem, PC Dose-response biochemical assay for inhibitors of Focal Adhesion Kinase (FAK) PubChem Bioassay (2007)[AID] 
Target
Name:
Focal adhesion kinase 1
Synonyms:
FADK 1 FAK1 FLT4 Focal adhesion kinase (FAK) Focal adhesion kinase 1 (FAK) Focal adhesion kinase-related nonkinase PTK2 Protein-tyrosine kinase 2 p125FAK | pp125FAK
Type:
Tyrosine-protein kinase
Mol. Mass.:
119233.17
Organism:
Homo sapiens (Human)
Description:
Q05397
Residue:
1052
  
Inhibitor
Name:
BDBM40956
Synonyms:
1-[2-[4-(4-chlorobenzyl)oxyphenyl]-4-cyano-oxazol-5-yl]isonipecotamide 1-[2-[4-[(4-chlorophenyl)methoxy]phenyl]-4-cyano-5-oxazolyl]-4-piperidinecarboxamide SMR000044900 | cid_664100
Type:
Small organic molecule
Emp. Form.:
C23H21ClN4O3
Mol. Mass.:
436.891
SMILES:
NC(=O)C1CCN(CC1)c1oc(nc1C#N)-c1ccc(OCc2ccc(Cl)cc2)cc1
: