Target
Cathepsin S
Ligand
BDBM35493
Substrate
Meas. Tech.
Cathepsin S dose-response confirmation
IC50
4.46333±0.401442 nM
Citation
 PubChem, PC Cathepsin S dose-response confirmation PubChem Bioassay (2008)[AID] 
Target
Name:
Cathepsin S
Synonyms:
CATS_HUMAN Cathepsin S (Cat S) | cathepsin S preproprotein
Type:
Protein
Mol. Mass.:
37507.38
Organism:
Homo sapiens (Human)
Description:
P25774
Residue:
331
  
Inhibitor
Name:
BDBM35493
Synonyms:
(2R,3R)-3-[[(1S)-1-(4-guanidinobutylcarbamoyl)-3-methyl-butyl]carbamoyl]oxirane-2-carboxylic acid (2R,3R)-3-[[(2S)-1-[4-[bis(azanyl)methylideneamino]butylamino]-4-methyl-1-oxidanylidene-pentan-2-yl]carbamoyl]oxirane-2-carboxylic acid E-64 SMR000058838 | cid_439487
Type:
Small organic molecule
Emp. Form.:
C15H27N5O5
Mol. Mass.:
357.4054
SMILES:
[#6]-[#6](-[#6])-[#6]-[#6@H](-[#7]-[#6](=O)-[#6@@H]-1-[#8]-[#6@H]-1-[#6](-[#8])=O)-[#6](=O)-[#7]-[#6]-[#6]-[#6]-[#6]\[#7]=[#6](\[#7])-[#7]
: