Target
P2X purinoceptor 3
Ligand
BDBM266243
Substrate
Meas. Tech.
Human P2X3 Receptor Inhibition Assay
pH
7.5±n/a
IC50
192±n/a nM
Comments
extracted
Citation
 Kai, HHoriguchi, TAsahi, KFujii, Y Triazine derivative and pharmaceutical composition having an analgesic activity comprising the same US Patent  US9718790 Publication Date 8/1/2017 
Target
Name:
P2X purinoceptor 3
Synonyms:
ATP receptor P2RX3 P2X purinoceptor 3 P2X purinoceptor 3 (P2X3) P2X3 purinoceptor p2x3 + hsa
Type:
Protein
Mol. Mass.:
44292.02
Organism:
Homo sapiens (Human)
Description:
P56373
Residue:
397
  
Inhibitor
Name:
BDBM266243
Synonyms:
US9718790, I-0782
Type:
Small organic molecule
Emp. Form.:
C26H31ClN4O5
Mol. Mass.:
515.001
SMILES:
CC[C@@H](CC(=O)OC)n1c(=O)[nH]\c(=N/c2ccc(OC(C)C)c(C)c2)n(Cc2ccc(Cl)cc2)c1=O
: