Target
P2X purinoceptor 3
Ligand
BDBM266248
Substrate
Meas. Tech.
Human P2X3 Receptor Inhibition Assay
pH
7.5±n/a
IC50
1.000±n/a nM
Comments
extracted
Citation
 Kai, HHoriguchi, TAsahi, KFujii, Y Triazine derivative and pharmaceutical composition having an analgesic activity comprising the same US Patent  US9718790 Publication Date 8/1/2017 
Target
Name:
P2X purinoceptor 3
Synonyms:
ATP receptor P2RX3 P2X purinoceptor 3 P2X purinoceptor 3 (P2X3) P2X3 purinoceptor p2x3 + hsa
Type:
Protein
Mol. Mass.:
44292.02
Organism:
Homo sapiens (Human)
Description:
P56373
Residue:
397
  
Inhibitor
Name:
BDBM266248
Synonyms:
US9718790, I-2183
Type:
Small organic molecule
Emp. Form.:
C25H26ClN5O4S
Mol. Mass.:
528.023
SMILES:
CCc1nc2ccc(cc2s1)\N=c1/[nH]c(=O)n(CCCCC(=O)OC)c(=O)n1Cc1ccc(Cl)cc1
: