Target
P2X purinoceptor 3
Ligand
BDBM266712
Substrate
Meas. Tech.
Human P2X3 Receptor Inhibition Assay
pH
7.5±n/a
IC50
1.000±n/a nM
Comments
extracted
Citation
 Kai, HHoriguchi, TAsahi, KFujii, Y Triazine derivative and pharmaceutical composition having an analgesic activity comprising the same US Patent  US9718790 Publication Date 8/1/2017 
Target
Name:
P2X purinoceptor 3
Synonyms:
ATP receptor P2RX3 P2X purinoceptor 3 P2X purinoceptor 3 (P2X3) P2X3 purinoceptor p2x3 + hsa
Type:
Protein
Mol. Mass.:
44292.02
Organism:
Homo sapiens (Human)
Description:
P56373
Residue:
397
  
Inhibitor
Name:
BDBM266712
Synonyms:
US9718790, I-2446
Type:
Small organic molecule
Emp. Form.:
C24H26N6O3
Mol. Mass.:
446.5016
SMILES:
C[C@H]1CC[C@H](Cn2c(=O)n(C)c(=O)[nH]\c2=N/c2ccc(Oc3cccc(n3)C#N)cc2)CC1
: