Target
P2X purinoceptor 3
Ligand
BDBM266759
Substrate
Meas. Tech.
Human P2X3 Receptor Inhibition Assay
pH
7.5±n/a
IC50
1.000±n/a nM
Comments
extracted
Citation
 Kai, HHoriguchi, TAsahi, KFujii, Y Triazine derivative and pharmaceutical composition having an analgesic activity comprising the same US Patent  US9718790 Publication Date 8/1/2017 
Target
Name:
P2X purinoceptor 3
Synonyms:
ATP receptor P2RX3 P2X purinoceptor 3 P2X purinoceptor 3 (P2X3) P2X3 purinoceptor p2x3 + hsa
Type:
Protein
Mol. Mass.:
44292.02
Organism:
Homo sapiens (Human)
Description:
P56373
Residue:
397
  
Inhibitor
Name:
BDBM266759
Synonyms:
US9718790, I-2494
Type:
Small organic molecule
Emp. Form.:
C25H28N6O3
Mol. Mass.:
460.5282
SMILES:
CCn1c(=O)[nH]\c(=N/c2ccc(Oc3cccc(n3)C#N)cc2)n(C[C@H]2CC[C@H](C)CC2)c1=O
: