Target
Galanin receptor type 2
Ligand
BDBM50007082
Substrate
Meas. Tech.
Dose Response cell-based high-throughput screening assay to identify antagonists of galanin receptor 2 (GALR2)
IC50
>4600±n/a nM
Citation
 PubChem, PC Dose Response cell-based high-throughput screening assay to identify antagonists of galanin receptor 2 (GALR2) PubChem Bioassay (2008)[AID] 
Target
Name:
Galanin receptor type 2
Synonyms:
GALNR2 GALR2_HUMAN Galanin receptor 2 Galanin receptor type 2 (GAL2-R) (GALR2).
Type:
Enzyme Catalytic Domain
Mol. Mass.:
41724.40
Organism:
Homo sapiens (Human)
Description:
Galanin R2 GALR2 HUMAN::O43603
Residue:
387
  
Inhibitor
Name:
BDBM50007082
Synonyms:
(E)-2-methoxy-4-(2-nitrovinyl)phenol 2-methoxy-4-(2-nitrovinyl)phenol cid_638439
Type:
Small organic molecule
Emp. Form.:
C9H9NO4
Mol. Mass.:
195.1721
SMILES:
COc1cc(\C=C\[N+]([O-])=O)ccc1O
: