Target
Galanin receptor type 2
Ligand
BDBM42053
Substrate
Meas. Tech.
Dose Response cell-based high-throughput screening assay to identify antagonists of galanin receptor 2 (GALR2)
IC50
6765±n/a nM
Citation
 PubChem, PC Dose Response cell-based high-throughput screening assay to identify antagonists of galanin receptor 2 (GALR2) PubChem Bioassay (2008)[AID] 
Target
Name:
Galanin receptor type 2
Synonyms:
GALNR2 GALR2_HUMAN Galanin receptor 2 Galanin receptor type 2 (GAL2-R) (GALR2).
Type:
Enzyme Catalytic Domain
Mol. Mass.:
41724.40
Organism:
Homo sapiens (Human)
Description:
Galanin R2 GALR2 HUMAN::O43603
Residue:
387
  
Inhibitor
Name:
BDBM42053
Synonyms:
MLS000573994 N-[4-[[(E)-3-(4-chlorophenyl)prop-2-enoyl]carbamothioylamino]phenyl]furan-2-carboxamide N-{4-[({[3-(4-chlorophenyl)acryloyl]amino}carbonothioyl)amino]phenyl}-2-furamide cid_1345012
Type:
Small organic molecule
Emp. Form.:
C21H16ClN3O3S
Mol. Mass.:
425.888
SMILES:
Clc1ccc(C=CC(=O)NC(=S)Nc2ccc(NC(=O)c3ccco3)cc2)cc1
: