Target
Galanin receptor type 2
Ligand
BDBM42060
Substrate
Meas. Tech.
Dose Response cell-based high-throughput screening assay to identify antagonists of galanin receptor 2 (GALR2)
IC50
5371±n/a nM
Citation
 PubChem, PC Dose Response cell-based high-throughput screening assay to identify antagonists of galanin receptor 2 (GALR2) PubChem Bioassay (2008)[AID] 
Target
Name:
Galanin receptor type 2
Synonyms:
GALNR2 GALR2_HUMAN Galanin receptor 2 Galanin receptor type 2 (GAL2-R) (GALR2).
Type:
Enzyme Catalytic Domain
Mol. Mass.:
41724.40
Organism:
Homo sapiens (Human)
Description:
Galanin R2 GALR2 HUMAN::O43603
Residue:
387
  
Inhibitor
Name:
BDBM42060
Synonyms:
4,5-bis(chloranyl)-2-[2-(4-naphthalen-2-ylsulfonylpiperazin-1-yl)-2-oxidanylidene-ethyl]pyridazin-3-one 4,5-dichloro-2-[2-[4-(2-naphthalenylsulfonyl)-1-piperazinyl]-2-oxoethyl]-3-pyridazinone MLS000374746 cid_2585042
Type:
Small organic molecule
Emp. Form.:
C20H18Cl2N4O4S
Mol. Mass.:
481.352
SMILES:
Clc1cnn(CC(=O)N2CCN(CC2)S(=O)(=O)c2ccc3ccccc3c2)c(=O)c1Cl
: