Target
Mitogen-activated protein kinase 10
Ligand
BDBM42856
Substrate
Meas. Tech.
Dose response biochemical screening assay for inhibitors of c-Jun N-Terminal Kinase 3 (JNK3)
IC50
2619±n/a nM
Citation
 PubChem, PC Dose response biochemical screening assay for inhibitors of c-Jun N-Terminal Kinase 3 (JNK3) PubChem Bioassay (2008)[AID] 
Target
Name:
Mitogen-activated protein kinase 10
Synonyms:
JNK3 MAP kinase p49 3F12 MK10_HUMAN Mitogen-activated protein kinase 10 (Stress-activated protein kinase JNK3) (c-Jun N-terminal kinase 3) (MAP kinase p49 3F12) PRKM10 Stress-activated protein kinase JNK3 | c-Jun N-terminal kinase 3 (JNK3)
Type:
Enzyme
Mol. Mass.:
52586.89
Organism:
Homo sapiens (Human)
Description:
Residue:
464
  
Inhibitor
Name:
BDBM42856
Synonyms:
2-(2-thenoylamino)thiophene-3-carboxamide 2-(thiophene-2-carbonylamino)thiophene-3-carboxamide MLS000103253 cid_2971411
Type:
Small organic molecule
Emp. Form.:
C10H8N2O2S2
Mol. Mass.:
252.313
SMILES:
NC(=O)c1ccsc1NC(=O)c1cccs1
: