Target
Nuclear receptor coactivator 1
Ligand
BDBM40305
Substrate
Meas. Tech.
Dose response biochemical High Throughput Screening assay for agonists of the steroid receptor coactivator 1 (SRC-1) recruitment by the peroxisome proliferator-activated receptor gamma (PPARgamma)
EC50
11190±n/a nM
Citation
 PubChem, PC Dose response biochemical High Throughput Screening assay for agonists of the steroid receptor coactivator 1 (SRC-1) recruitment by the peroxisome proliferator-activated receptor gamma (PPARgamma) PubChem Bioassay (2008)[AID] 
Target
Name:
Nuclear receptor coactivator 1
Synonyms:
BHLHE74 NCOA1 NCoA-1 Protein Hin-2 Renal carcinoma antigen NY-REN-52 SRC1 nuclear receptor coactivator 1 isoform 1
Type:
PROTEIN
Mol. Mass.:
156749.34
Organism:
Homo sapiens (Human)
Description:
ChEMBL_759690
Residue:
1441
  
Inhibitor
Name:
BDBM40305
Synonyms:
2-[(6-amino-3,5-dicyano-4-p-phenetyl-2-pyridyl)thio]acetic acid butyl ester MLS000079557 butyl 2-[6-amino-3,5-dicyano-4-(4-ethoxyphenyl)pyridin-2-yl]sulfanylacetate cid_659844
Type:
Small organic molecule
Emp. Form.:
C21H22N4O3S
Mol. Mass.:
410.489
SMILES:
CCCCOC(=O)CSc1nc(N)c(C#N)c(-c2ccc(OCC)cc2)c1C#N
: