Target
Nuclear receptor coactivator 1
Ligand
BDBM42903
Substrate
Meas. Tech.
Dose response biochemical High Throughput Screening assay for agonists of the steroid receptor coactivator 1 (SRC-1) recruitment by the peroxisome proliferator-activated receptor gamma (PPARgamma)
EC50
8464±n/a nM
Citation
 PubChem, PC Dose response biochemical High Throughput Screening assay for agonists of the steroid receptor coactivator 1 (SRC-1) recruitment by the peroxisome proliferator-activated receptor gamma (PPARgamma) PubChem Bioassay (2008)[AID] 
Target
Name:
Nuclear receptor coactivator 1
Synonyms:
BHLHE74 NCOA1 NCoA-1 Protein Hin-2 Renal carcinoma antigen NY-REN-52 SRC1 nuclear receptor coactivator 1 isoform 1
Type:
PROTEIN
Mol. Mass.:
156749.34
Organism:
Homo sapiens (Human)
Description:
ChEMBL_759690
Residue:
1441
  
Inhibitor
Name:
BDBM42903
Synonyms:
MLS000040305 N-[(1S)-1-[5-[(3-fluorophenyl)methylthio]-1,3,4-oxadiazol-2-yl]-2-methylpropyl]carbamic acid tert-butyl ester cid_662313 tert-butyl N-[(1S)-1-[5-[(3-fluorophenyl)methylsulfanyl]-1,3,4-oxadiazol-2-yl]-2-methylpropyl]carbamate
Type:
Small organic molecule
Emp. Form.:
C18H24FN3O3S
Mol. Mass.:
381.465
SMILES:
CC(C)[C@H](NC(=O)OC(C)(C)C)c1nnc(SCc2cccc(F)c2)o1
: