Target
Nuclear receptor coactivator 1
Ligand
BDBM42923
Substrate
Meas. Tech.
Dose response biochemical High Throughput Screening assay for agonists of the steroid receptor coactivator 1 (SRC-1) recruitment by the peroxisome proliferator-activated receptor gamma (PPARgamma)
EC50
16860±n/a nM
Citation
 PubChem, PC Dose response biochemical High Throughput Screening assay for agonists of the steroid receptor coactivator 1 (SRC-1) recruitment by the peroxisome proliferator-activated receptor gamma (PPARgamma) PubChem Bioassay (2008)[AID] 
Target
Name:
Nuclear receptor coactivator 1
Synonyms:
BHLHE74 NCOA1 NCoA-1 Protein Hin-2 Renal carcinoma antigen NY-REN-52 SRC1 nuclear receptor coactivator 1 isoform 1
Type:
PROTEIN
Mol. Mass.:
156749.34
Organism:
Homo sapiens (Human)
Description:
ChEMBL_759690
Residue:
1441
  
Inhibitor
Name:
BDBM42923
Synonyms:
2-(1,3-benzoxazol-2-ylsulfanyl)-1-(3,4,5-trimethoxyphenyl)ethanone MLS000082210 cid_2365424
Type:
Small organic molecule
Emp. Form.:
C18H17NO5S
Mol. Mass.:
359.396
SMILES:
COc1cc(cc(OC)c1OC)C(=O)CSc1nc2ccccc2o1
: