Target
Nuclear receptor coactivator 1
Ligand
BDBM42930
Substrate
Meas. Tech.
Dose response biochemical High Throughput Screening assay for agonists of the steroid receptor coactivator 1 (SRC-1) recruitment by the peroxisome proliferator-activated receptor gamma (PPARgamma)
EC50
16810±n/a nM
Citation
 PubChem, PC Dose response biochemical High Throughput Screening assay for agonists of the steroid receptor coactivator 1 (SRC-1) recruitment by the peroxisome proliferator-activated receptor gamma (PPARgamma) PubChem Bioassay (2008)[AID] 
Target
Name:
Nuclear receptor coactivator 1
Synonyms:
BHLHE74 NCOA1 NCoA-1 Protein Hin-2 Renal carcinoma antigen NY-REN-52 SRC1 nuclear receptor coactivator 1 isoform 1
Type:
PROTEIN
Mol. Mass.:
156749.34
Organism:
Homo sapiens (Human)
Description:
ChEMBL_759690
Residue:
1441
  
Inhibitor
Name:
BDBM42930
Synonyms:
6-(4-fluorophenyl)-3-methyl-N-(6-methyl-2-pyridinyl)-2-imidazo[2,1-b]thiazolecarboxamide 6-(4-fluorophenyl)-3-methyl-N-(6-methylpyridin-2-yl)imidazo[2,1-b][1,3]thiazole-2-carboxamide SMR000027827 | cid_3240065
Type:
Small organic molecule
Emp. Form.:
C19H15FN4OS
Mol. Mass.:
366.412
SMILES:
Cc1c(sc2nc(cn12)-c1ccc(F)cc1)C(=O)Nc1cccc(C)n1
: