Target
Nuclear receptor coactivator 1
Ligand
BDBM42932
Substrate
Meas. Tech.
Dose response biochemical High Throughput Screening assay for agonists of the steroid receptor coactivator 1 (SRC-1) recruitment by the peroxisome proliferator-activated receptor gamma (PPARgamma)
EC50
8097±n/a nM
Citation
 PubChem, PC Dose response biochemical High Throughput Screening assay for agonists of the steroid receptor coactivator 1 (SRC-1) recruitment by the peroxisome proliferator-activated receptor gamma (PPARgamma) PubChem Bioassay (2008)[AID] 
Target
Name:
Nuclear receptor coactivator 1
Synonyms:
BHLHE74 NCOA1 NCoA-1 Protein Hin-2 Renal carcinoma antigen NY-REN-52 SRC1 nuclear receptor coactivator 1 isoform 1
Type:
PROTEIN
Mol. Mass.:
156749.34
Organism:
Homo sapiens (Human)
Description:
ChEMBL_759690
Residue:
1441
  
Inhibitor
Name:
BDBM42932
Synonyms:
2-[(3,4-dimethoxyphenyl)-oxomethyl]imino-3,4-dimethyl-5-thiazolecarboxylic acid ethyl ester MLS000087874 cid_3240209 ethyl 2-(3,4-dimethoxybenzoyl)imino-3,4-dimethyl-1,3-thiazole-5-carboxylate | ethyl 2-(3,4-dimethoxyphenyl)carbonylimino-3,4-dimethyl-1,3-thiazole-5-carboxylate
Type:
Small organic molecule
Emp. Form.:
C17H20N2O5S
Mol. Mass.:
364.416
SMILES:
CCOC(=O)c1s\c(=N\C(=O)c2ccc(OC)c(OC)c2)n(C)c1C
: