Target
Nuclear receptor coactivator 1
Ligand
BDBM42955
Substrate
Meas. Tech.
Dose response biochemical High Throughput Screening assay for agonists of the steroid receptor coactivator 1 (SRC-1) recruitment by the peroxisome proliferator-activated receptor gamma (PPARgamma)
EC50
24570±n/a nM
Citation
 PubChem, PC Dose response biochemical High Throughput Screening assay for agonists of the steroid receptor coactivator 1 (SRC-1) recruitment by the peroxisome proliferator-activated receptor gamma (PPARgamma) PubChem Bioassay (2008)[AID] 
Target
Name:
Nuclear receptor coactivator 1
Synonyms:
BHLHE74 NCOA1 NCoA-1 Protein Hin-2 Renal carcinoma antigen NY-REN-52 SRC1 nuclear receptor coactivator 1 isoform 1
Type:
PROTEIN
Mol. Mass.:
156749.34
Organism:
Homo sapiens (Human)
Description:
ChEMBL_759690
Residue:
1441
  
Inhibitor
Name:
BDBM42955
Synonyms:
8-ethoxy-2-keto-N-(5-methylisoxazol-3-yl)chromene-3-carboxamide 8-ethoxy-N-(5-methyl-1,2-oxazol-3-yl)-2-oxochromene-3-carboxamide 8-ethoxy-N-(5-methyl-3-isoxazolyl)-2-oxo-2H-chromene-3-carboxamide SMR000080275 | cid_1245020
Type:
Small organic molecule
Emp. Form.:
C16H14N2O5
Mol. Mass.:
314.2928
SMILES:
CCOc1cccc2cc(C(=O)Nc3cc(C)on3)c(=O)oc12
: