Target
Nuclear receptor coactivator 1
Ligand
BDBM40985
Substrate
Meas. Tech.
Dose response biochemical High Throughput Screening assay for agonists of the steroid receptor coactivator 1 (SRC-1) recruitment by the peroxisome proliferator-activated receptor gamma (PPARgamma)
EC50
9048±n/a nM
Citation
 PubChem, PC Dose response biochemical High Throughput Screening assay for agonists of the steroid receptor coactivator 1 (SRC-1) recruitment by the peroxisome proliferator-activated receptor gamma (PPARgamma) PubChem Bioassay (2008)[AID] 
Target
Name:
Nuclear receptor coactivator 1
Synonyms:
BHLHE74 NCOA1 NCoA-1 Protein Hin-2 Renal carcinoma antigen NY-REN-52 SRC1 nuclear receptor coactivator 1 isoform 1
Type:
PROTEIN
Mol. Mass.:
156749.34
Organism:
Homo sapiens (Human)
Description:
ChEMBL_759690
Residue:
1441
  
Inhibitor
Name:
BDBM40985
Synonyms:
2-(4-chloranyl-3-methyl-phenoxy)-N-[2-methyl-5-(3-methyl-[1,2,4]triazolo[3,4-b][1,3,4]thiadiazol-6-yl)phenyl]ethanamide 2-(4-chloro-3-methylphenoxy)-N-[2-methyl-5-(3-methyl-[1,2,4]triazolo[3,4-b][1,3,4]thiadiazol-6-yl)phenyl]acetamide SMR000092747 | cid_4454678
Type:
Small organic molecule
Emp. Form.:
C20H18ClN5O2S
Mol. Mass.:
427.907
SMILES:
Cc1nnc2sc(nn12)-c1ccc(C)c(NC(=O)COc2ccc(Cl)c(C)c2)c1
: