Target
Nuclear receptor coactivator 1
Ligand
BDBM42977
Substrate
Meas. Tech.
Dose response biochemical High Throughput Screening assay for agonists of the steroid receptor coactivator 1 (SRC-1) recruitment by the peroxisome proliferator-activated receptor gamma (PPARgamma)
EC50
24650±n/a nM
Citation
 PubChem, PC Dose response biochemical High Throughput Screening assay for agonists of the steroid receptor coactivator 1 (SRC-1) recruitment by the peroxisome proliferator-activated receptor gamma (PPARgamma) PubChem Bioassay (2008)[AID] 
Target
Name:
Nuclear receptor coactivator 1
Synonyms:
BHLHE74 NCOA1 NCoA-1 Protein Hin-2 Renal carcinoma antigen NY-REN-52 SRC1 nuclear receptor coactivator 1 isoform 1
Type:
PROTEIN
Mol. Mass.:
156749.34
Organism:
Homo sapiens (Human)
Description:
ChEMBL_759690
Residue:
1441
  
Inhibitor
Name:
BDBM42977
Synonyms:
5-[(5-carbomethoxy-2-thienyl)sulfonyl]thiophene-2-carboxylic acid methyl ester MLS000107311 cid_2251704 | methyl 5-(5-methoxycarbonylthiophen-2-yl)sulfonylthiophene-2-carboxylate
Type:
Small organic molecule
Emp. Form.:
C12H10O6S3
Mol. Mass.:
346.399
SMILES:
COC(=O)c1ccc(s1)S(=O)(=O)c1ccc(s1)C(=O)OC
: