Target
Nuclear receptor coactivator 1
Ligand
BDBM43007
Substrate
Meas. Tech.
Dose response biochemical High Throughput Screening assay for agonists of the steroid receptor coactivator 1 (SRC-1) recruitment by the peroxisome proliferator-activated receptor gamma (PPARgamma)
EC50
18440±n/a nM
Citation
 PubChem, PC Dose response biochemical High Throughput Screening assay for agonists of the steroid receptor coactivator 1 (SRC-1) recruitment by the peroxisome proliferator-activated receptor gamma (PPARgamma) PubChem Bioassay (2008)[AID] 
Target
Name:
Nuclear receptor coactivator 1
Synonyms:
BHLHE74 NCOA1 NCoA-1 Protein Hin-2 Renal carcinoma antigen NY-REN-52 SRC1 nuclear receptor coactivator 1 isoform 1
Type:
PROTEIN
Mol. Mass.:
156749.34
Organism:
Homo sapiens (Human)
Description:
ChEMBL_759690
Residue:
1441
  
Inhibitor
Name:
BDBM43007
Synonyms:
5-chloranyl-N-(4-methoxy-3-prop-2-ynyl-1,3-benzothiazol-2-ylidene)thiophene-2-carboxamide 5-chloro-N-(4-methoxy-3-prop-2-ynyl-1,3-benzothiazol-2-ylidene)thiophene-2-carboxamide MLS000530135 cid_2151362
Type:
Small organic molecule
Emp. Form.:
C16H11ClN2O2S2
Mol. Mass.:
362.854
SMILES:
COc1cccc2s\c(=N/C(=O)c3ccc(Cl)s3)n(CC#C)c12
: