Target
Nuclear receptor coactivator 1
Ligand
BDBM43013
Substrate
Meas. Tech.
Dose response biochemical High Throughput Screening assay for agonists of the steroid receptor coactivator 1 (SRC-1) recruitment by the peroxisome proliferator-activated receptor gamma (PPARgamma)
EC50
18780±n/a nM
Citation
 PubChem, PC Dose response biochemical High Throughput Screening assay for agonists of the steroid receptor coactivator 1 (SRC-1) recruitment by the peroxisome proliferator-activated receptor gamma (PPARgamma) PubChem Bioassay (2008)[AID] 
Target
Name:
Nuclear receptor coactivator 1
Synonyms:
BHLHE74 NCOA1 NCoA-1 Protein Hin-2 Renal carcinoma antigen NY-REN-52 SRC1 nuclear receptor coactivator 1 isoform 1
Type:
PROTEIN
Mol. Mass.:
156749.34
Organism:
Homo sapiens (Human)
Description:
ChEMBL_759690
Residue:
1441
  
Inhibitor
Name:
BDBM43013
Synonyms:
2-[3-cyano-6-(4-methoxyphenyl)-4-thiophen-2-yl-pyridin-2-yl]sulfanyl-N-(phenylmethyl)ethanamide MLS000555973 N-benzyl-2-[3-cyano-6-(4-methoxyphenyl)-4-thiophen-2-ylpyridin-2-yl]sulfanylacetamide SMR000147490 | cid_1004501
Type:
Small organic molecule
Emp. Form.:
C26H21N3O2S2
Mol. Mass.:
471.594
SMILES:
COc1ccc(cc1)-c1cc(-c2cccs2)c(C#N)c(SCC(=O)NCc2ccccc2)n1
: