Target
Nuclear receptor coactivator 1
Ligand
BDBM43020
Substrate
Meas. Tech.
Dose response biochemical High Throughput Screening assay for agonists of the steroid receptor coactivator 1 (SRC-1) recruitment by the peroxisome proliferator-activated receptor gamma (PPARgamma)
EC50
18350±n/a nM
Citation
 PubChem, PC Dose response biochemical High Throughput Screening assay for agonists of the steroid receptor coactivator 1 (SRC-1) recruitment by the peroxisome proliferator-activated receptor gamma (PPARgamma) PubChem Bioassay (2008)[AID] 
Target
Name:
Nuclear receptor coactivator 1
Synonyms:
BHLHE74 NCOA1 NCoA-1 Protein Hin-2 Renal carcinoma antigen NY-REN-52 SRC1 nuclear receptor coactivator 1 isoform 1
Type:
PROTEIN
Mol. Mass.:
156749.34
Organism:
Homo sapiens (Human)
Description:
ChEMBL_759690
Residue:
1441
  
Inhibitor
Name:
BDBM43020
Synonyms:
6-amino-5-[1-(4-chlorophenyl)-3-methyl-thieno[2,3-c]pyrazole-5-carbonyl]-1,3-dimethyl-pyrimidine-2,4-quinone 6-amino-5-[[1-(4-chlorophenyl)-3-methyl-5-thieno[2,3-c]pyrazolyl]-oxomethyl]-1,3-dimethylpyrimidine-2,4-dione MLS000564164 cid_2395593
Type:
Small organic molecule
Emp. Form.:
C19H16ClN5O3S
Mol. Mass.:
429.88
SMILES:
Cc1nn(-c2ccc(Cl)cc2)c2sc(cc12)C(=O)c1c(N)n(C)c(=O)n(C)c1=O
: