Target
Nuclear receptor coactivator 1
Ligand
BDBM43023
Substrate
Meas. Tech.
Dose response biochemical High Throughput Screening assay for agonists of the steroid receptor coactivator 1 (SRC-1) recruitment by the peroxisome proliferator-activated receptor gamma (PPARgamma)
EC50
13260±n/a nM
Citation
 PubChem, PC Dose response biochemical High Throughput Screening assay for agonists of the steroid receptor coactivator 1 (SRC-1) recruitment by the peroxisome proliferator-activated receptor gamma (PPARgamma) PubChem Bioassay (2008)[AID] 
Target
Name:
Nuclear receptor coactivator 1
Synonyms:
BHLHE74 NCOA1 NCoA-1 Protein Hin-2 Renal carcinoma antigen NY-REN-52 SRC1 nuclear receptor coactivator 1 isoform 1
Type:
PROTEIN
Mol. Mass.:
156749.34
Organism:
Homo sapiens (Human)
Description:
ChEMBL_759690
Residue:
1441
  
Inhibitor
Name:
BDBM43023
Synonyms:
2-[[5-(1-benzofuran-2-yl)-4-methyl-1,2,4-triazol-3-yl]sulfanyl]-N-(3-bromophenyl)acetamide 2-[[5-(2-benzofuranyl)-4-methyl-1,2,4-triazol-3-yl]thio]-N-(3-bromophenyl)acetamide 2-{[5-(1-benzofuran-2-yl)-4-methyl-4H-1,2,4-triazol-3-yl]thio}-N-(3-bromophenyl)acetamide SMR000143743 | cid_1262634
Type:
Small organic molecule
Emp. Form.:
C19H15BrN4O2S
Mol. Mass.:
443.317
SMILES:
Cn1c(SCC(=O)Nc2cccc(Br)c2)nnc1-c1cc2ccccc2o1
: