Target
Nuclear receptor coactivator 1
Ligand
BDBM33694
Substrate
Meas. Tech.
Dose response biochemical High Throughput Screening assay for agonists of the steroid receptor coactivator 1 (SRC-1) recruitment by the peroxisome proliferator-activated receptor gamma (PPARgamma)
EC50
8560±n/a nM
Citation
 PubChem, PC Dose response biochemical High Throughput Screening assay for agonists of the steroid receptor coactivator 1 (SRC-1) recruitment by the peroxisome proliferator-activated receptor gamma (PPARgamma) PubChem Bioassay (2008)[AID] 
Target
Name:
Nuclear receptor coactivator 1
Synonyms:
BHLHE74 NCOA1 NCoA-1 Protein Hin-2 Renal carcinoma antigen NY-REN-52 SRC1 nuclear receptor coactivator 1 isoform 1
Type:
PROTEIN
Mol. Mass.:
156749.34
Organism:
Homo sapiens (Human)
Description:
ChEMBL_759690
Residue:
1441
  
Inhibitor
Name:
BDBM33694
Synonyms:
2-[[1-(3,5-dimethoxyphenyl)-1,2,3,4-tetrazol-5-yl]sulfanyl]-N-(4-ethanoylphenyl)ethanamide N-(4-Acetyl-phenyl)-2-[1-(3,5-dimethoxy-phenyl)-1H-tetrazol-5-ylsulfanyl]-acetamide N-(4-acetylphenyl)-2-[[1-(3,5-dimethoxyphenyl)-5-tetrazolyl]thio]acetamide SMR000118398 | cid_1175547
Type:
Small organic molecule
Emp. Form.:
C19H19N5O4S
Mol. Mass.:
413.45
SMILES:
COc1cc(OC)cc(c1)-n1nnnc1SCC(=O)Nc1ccc(cc1)C(C)=O
: