Target
Nuclear receptor coactivator 1
Ligand
BDBM43037
Substrate
Meas. Tech.
Dose response biochemical High Throughput Screening assay for agonists of the steroid receptor coactivator 1 (SRC-1) recruitment by the peroxisome proliferator-activated receptor gamma (PPARgamma)
EC50
19810±n/a nM
Citation
 PubChem, PC Dose response biochemical High Throughput Screening assay for agonists of the steroid receptor coactivator 1 (SRC-1) recruitment by the peroxisome proliferator-activated receptor gamma (PPARgamma) PubChem Bioassay (2008)[AID] 
Target
Name:
Nuclear receptor coactivator 1
Synonyms:
BHLHE74 NCOA1 NCoA-1 Protein Hin-2 Renal carcinoma antigen NY-REN-52 SRC1 nuclear receptor coactivator 1 isoform 1
Type:
PROTEIN
Mol. Mass.:
156749.34
Organism:
Homo sapiens (Human)
Description:
ChEMBL_759690
Residue:
1441
  
Inhibitor
Name:
BDBM43037
Synonyms:
3,6-bis(chloranyl)-1-[2-[[3-chloranyl-5-(trifluoromethyl)pyridin-2-yl]amino]ethyl]quinoxalin-2-one 3,6-dichloro-1-[2-[[3-chloro-5-(trifluoromethyl)-2-pyridinyl]amino]ethyl]-2-quinoxalinone 3,6-dichloro-1-[2-[[3-chloro-5-(trifluoromethyl)pyridin-2-yl]amino]ethyl]quinoxalin-2-one SMR000170129 | cid_1471937
Type:
Small organic molecule
Emp. Form.:
C16H10Cl3F3N4O
Mol. Mass.:
437.631
SMILES:
FC(F)(F)c1cnc(NCCn2c3ccc(Cl)cc3nc(Cl)c2=O)c(Cl)c1
: