Target
Nuclear receptor coactivator 1
Ligand
BDBM43054
Substrate
Meas. Tech.
Dose response biochemical High Throughput Screening assay for agonists of the steroid receptor coactivator 1 (SRC-1) recruitment by the peroxisome proliferator-activated receptor gamma (PPARgamma)
EC50
14380±n/a nM
Citation
 PubChem, PC Dose response biochemical High Throughput Screening assay for agonists of the steroid receptor coactivator 1 (SRC-1) recruitment by the peroxisome proliferator-activated receptor gamma (PPARgamma) PubChem Bioassay (2008)[AID] 
Target
Name:
Nuclear receptor coactivator 1
Synonyms:
BHLHE74 NCOA1 NCoA-1 Protein Hin-2 Renal carcinoma antigen NY-REN-52 SRC1 nuclear receptor coactivator 1 isoform 1
Type:
PROTEIN
Mol. Mass.:
156749.34
Organism:
Homo sapiens (Human)
Description:
ChEMBL_759690
Residue:
1441
  
Inhibitor
Name:
BDBM43054
Synonyms:
MLS000543203 [2-(4-chlorophenyl)-1,3-thiazol-5-yl](phenyl)methanone [2-(4-chlorophenyl)-1,3-thiazol-5-yl]-phenylmethanone [2-(4-chlorophenyl)thiazol-5-yl]-phenyl-methanone | cid_3789019
Type:
Small organic molecule
Emp. Form.:
C16H10ClNOS
Mol. Mass.:
299.775
SMILES:
Clc1ccc(cc1)-c1ncc(s1)C(=O)c1ccccc1
: