Target
Nuclear receptor coactivator 1
Ligand
BDBM43056
Substrate
Meas. Tech.
Dose response biochemical High Throughput Screening assay for agonists of the steroid receptor coactivator 1 (SRC-1) recruitment by the peroxisome proliferator-activated receptor gamma (PPARgamma)
EC50
17070±n/a nM
Citation
 PubChem, PC Dose response biochemical High Throughput Screening assay for agonists of the steroid receptor coactivator 1 (SRC-1) recruitment by the peroxisome proliferator-activated receptor gamma (PPARgamma) PubChem Bioassay (2008)[AID] 
Target
Name:
Nuclear receptor coactivator 1
Synonyms:
BHLHE74 NCOA1 NCoA-1 Protein Hin-2 Renal carcinoma antigen NY-REN-52 SRC1 nuclear receptor coactivator 1 isoform 1
Type:
PROTEIN
Mol. Mass.:
156749.34
Organism:
Homo sapiens (Human)
Description:
ChEMBL_759690
Residue:
1441
  
Inhibitor
Name:
BDBM43056
Synonyms:
4-[4-(2,4-dichlorophenyl)-1,3-thiazol-2-yl]-N-prop-2-enyl-benzamide 4-[4-(2,4-dichlorophenyl)-2-thiazolyl]-N-prop-2-enylbenzamide N-allyl-4-[4-(2,4-dichlorophenyl)-1,3-thiazol-2-yl]benzenecarboxamide SMR000169419 | cid_3722334
Type:
Small organic molecule
Emp. Form.:
C19H14Cl2N2OS
Mol. Mass.:
389.298
SMILES:
Clc1ccc(-c2csc(n2)-c2ccc(cc2)C(=O)NCC=C)c(Cl)c1
: