Target
Nuclear receptor coactivator 1
Ligand
BDBM43062
Substrate
Meas. Tech.
Dose response biochemical High Throughput Screening assay for agonists of the steroid receptor coactivator 1 (SRC-1) recruitment by the peroxisome proliferator-activated receptor gamma (PPARgamma)
EC50
18980±n/a nM
Citation
 PubChem, PC Dose response biochemical High Throughput Screening assay for agonists of the steroid receptor coactivator 1 (SRC-1) recruitment by the peroxisome proliferator-activated receptor gamma (PPARgamma) PubChem Bioassay (2008)[AID] 
Target
Name:
Nuclear receptor coactivator 1
Synonyms:
BHLHE74 NCOA1 NCoA-1 Protein Hin-2 Renal carcinoma antigen NY-REN-52 SRC1 nuclear receptor coactivator 1 isoform 1
Type:
PROTEIN
Mol. Mass.:
156749.34
Organism:
Homo sapiens (Human)
Description:
ChEMBL_759690
Residue:
1441
  
Inhibitor
Name:
BDBM43062
Synonyms:
2-(3-Cyano-6-methyl-quinolin-2-ylsulfanyl)-N-thiophen-2-ylmethyl-acetamide 2-(3-cyano-6-methylquinolin-2-yl)sulfanyl-N-(thiophen-2-ylmethyl)acetamide 2-[(3-cyano-6-methyl-2-quinolyl)thio]-N-(2-thenyl)acetamide SMR000173141 | cid_3207506
Type:
Small organic molecule
Emp. Form.:
C18H15N3OS2
Mol. Mass.:
353.461
SMILES:
Cc1ccc2nc(SCC(=O)NCc3cccs3)c(cc2c1)C#N
: