Target
Nuclear receptor coactivator 1
Ligand
BDBM43066
Substrate
Meas. Tech.
Dose response biochemical High Throughput Screening assay for agonists of the steroid receptor coactivator 1 (SRC-1) recruitment by the peroxisome proliferator-activated receptor gamma (PPARgamma)
EC50
16400±n/a nM
Citation
 PubChem, PC Dose response biochemical High Throughput Screening assay for agonists of the steroid receptor coactivator 1 (SRC-1) recruitment by the peroxisome proliferator-activated receptor gamma (PPARgamma) PubChem Bioassay (2008)[AID] 
Target
Name:
Nuclear receptor coactivator 1
Synonyms:
BHLHE74 NCOA1 NCoA-1 Protein Hin-2 Renal carcinoma antigen NY-REN-52 SRC1 nuclear receptor coactivator 1 isoform 1
Type:
PROTEIN
Mol. Mass.:
156749.34
Organism:
Homo sapiens (Human)
Description:
ChEMBL_759690
Residue:
1441
  
Inhibitor
Name:
BDBM43066
Synonyms:
4-[[4-(4-chlorophenyl)-3-cyano-6-phenyl-2-pyridinyl]thio]-3-oxobutanoic acid ethyl ester MLS000581826 cid_2216871 ethyl 4-[4-(4-chlorophenyl)-3-cyano-6-phenylpyridin-2-yl]sulfanyl-3-oxobutanoate | ethyl 4-{[4-(4-chlorophenyl)-3-cyano-6-phenyl-2-pyridinyl]thio}-3-oxobutanoate
Type:
Small organic molecule
Emp. Form.:
C24H19ClN2O3S
Mol. Mass.:
450.937
SMILES:
CCOC(=O)CC(=O)CSc1nc(cc(-c2ccc(Cl)cc2)c1C#N)-c1ccccc1
: