Target
Nuclear receptor coactivator 1
Ligand
BDBM43070
Substrate
Meas. Tech.
Dose response biochemical High Throughput Screening assay for agonists of the steroid receptor coactivator 1 (SRC-1) recruitment by the peroxisome proliferator-activated receptor gamma (PPARgamma)
EC50
6075±n/a nM
Citation
 PubChem, PC Dose response biochemical High Throughput Screening assay for agonists of the steroid receptor coactivator 1 (SRC-1) recruitment by the peroxisome proliferator-activated receptor gamma (PPARgamma) PubChem Bioassay (2008)[AID] 
Target
Name:
Nuclear receptor coactivator 1
Synonyms:
BHLHE74 NCOA1 NCoA-1 Protein Hin-2 Renal carcinoma antigen NY-REN-52 SRC1 nuclear receptor coactivator 1 isoform 1
Type:
PROTEIN
Mol. Mass.:
156749.34
Organism:
Homo sapiens (Human)
Description:
ChEMBL_759690
Residue:
1441
  
Inhibitor
Name:
BDBM43070
Synonyms:
MLS000560834 N'-(2-naphthalen-2-yloxyethanoyl)-2-phenyl-ethanehydrazide N'-[2-(2-naphthoxy)acetyl]-2-phenyl-acetohydrazide SMR000175174 | cid_809243
Type:
Small organic molecule
Emp. Form.:
C20H18N2O3
Mol. Mass.:
334.3685
SMILES:
O=C(COc1ccc2ccccc2c1)NNC(=O)Cc1ccccc1
: