Target
Nuclear receptor coactivator 1
Ligand
BDBM43090
Substrate
Meas. Tech.
Dose response biochemical High Throughput Screening assay for agonists of the steroid receptor coactivator 1 (SRC-1) recruitment by the peroxisome proliferator-activated receptor gamma (PPARgamma)
EC50
13370±n/a nM
Citation
 PubChem, PC Dose response biochemical High Throughput Screening assay for agonists of the steroid receptor coactivator 1 (SRC-1) recruitment by the peroxisome proliferator-activated receptor gamma (PPARgamma) PubChem Bioassay (2008)[AID] 
Target
Name:
Nuclear receptor coactivator 1
Synonyms:
BHLHE74 NCOA1 NCoA-1 Protein Hin-2 Renal carcinoma antigen NY-REN-52 SRC1 nuclear receptor coactivator 1 isoform 1
Type:
PROTEIN
Mol. Mass.:
156749.34
Organism:
Homo sapiens (Human)
Description:
ChEMBL_759690
Residue:
1441
  
Inhibitor
Name:
BDBM43090
Synonyms:
2,5-bis(chloranyl)-N-[3-(2-ethoxyethyl)-6-sulfamoyl-1,3-benzothiazol-2-ylidene]thiophene-3-carboxamide 2,5-dichloro-N-[3-(2-ethoxyethyl)-6-sulfamoyl-1,3-benzothiazol-2-ylidene]thiophene-3-carboxamide SMR000237867 | cid_4142608
Type:
Small organic molecule
Emp. Form.:
C16H15Cl2N3O4S3
Mol. Mass.:
480.409
SMILES:
CCOCCn1c2ccc(cc2s\c1=N/C(=O)c1cc(Cl)sc1Cl)S(N)(=O)=O
: