Target
Nuclear receptor coactivator 1
Ligand
BDBM43160
Substrate
Meas. Tech.
Dose response biochemical High Throughput Screening assay for agonists of the steroid receptor coactivator 1 (SRC-1) recruitment by the peroxisome proliferator-activated receptor gamma (PPARgamma)
EC50
20380±n/a nM
Citation
 PubChem, PC Dose response biochemical High Throughput Screening assay for agonists of the steroid receptor coactivator 1 (SRC-1) recruitment by the peroxisome proliferator-activated receptor gamma (PPARgamma) PubChem Bioassay (2008)[AID] 
Target
Name:
Nuclear receptor coactivator 1
Synonyms:
BHLHE74 NCOA1 NCoA-1 Protein Hin-2 Renal carcinoma antigen NY-REN-52 SRC1 nuclear receptor coactivator 1 isoform 1
Type:
PROTEIN
Mol. Mass.:
156749.34
Organism:
Homo sapiens (Human)
Description:
ChEMBL_759690
Residue:
1441
  
Inhibitor
Name:
BDBM43160
Synonyms:
1-(1,3-benzodioxol-5-ylmethyl)-3-(2,1,3-benzothiadiazol-5-yl)urea MLS000677397 cid_778346
Type:
Small organic molecule
Emp. Form.:
C15H12N4O3S
Mol. Mass.:
328.346
SMILES:
O=C(NCc1ccc2OCOc2c1)Nc1ccc2nsnc2c1
: