Target
Signal transducer and activator of transcription 1-alpha/beta
Ligand
BDBM43545
Substrate
Meas. Tech.
Dose response counterscreen assay for STAT3 activators: cell-based high throughput assay to measure STAT1 activation
EC50
>55700±n/a nM
Citation
 PubChem, PC Dose response counterscreen assay for STAT3 activators: cell-based high throughput assay to measure STAT1 activation PubChem Bioassay (2008)[AID] 
Target
Name:
Signal transducer and activator of transcription 1-alpha/beta
Synonyms:
STAT1 Signal transducer and activator of transcription 1-alpha/beta Transcription factor ISGF-3 components p91/p84 | signal transducer and activator of transcription 1 isoform alpha
Type:
Cytosolic Transcription Factor
Mol. Mass.:
87327.69
Organism:
Homo sapiens (Human)
Description:
Stat1 was expressed in sf9 cells from a baculovirus encoding the recombinant proteins. Stat1 dimer binds to DNA.
Residue:
750
  
Inhibitor
Name:
BDBM43545
Synonyms:
(3-Cyano-indol-1-yl)-acetic acid 2-(3-cyanoindol-1-yl)acetic acid MLS000032236 cid_652683
Type:
Small organic molecule
Emp. Form.:
C11H8N2O2
Mol. Mass.:
200.1934
SMILES:
OC(=O)Cn1cc(C#N)c2ccccc12
: