Target
Signal transducer and activator of transcription 1-alpha/beta
Ligand
BDBM43546
Substrate
Meas. Tech.
Dose response counterscreen assay for STAT3 activators: cell-based high throughput assay to measure STAT1 activation
EC50
>55700±n/a nM
Citation
 PubChem, PC Dose response counterscreen assay for STAT3 activators: cell-based high throughput assay to measure STAT1 activation PubChem Bioassay (2008)[AID] 
Target
Name:
Signal transducer and activator of transcription 1-alpha/beta
Synonyms:
STAT1 Signal transducer and activator of transcription 1-alpha/beta Transcription factor ISGF-3 components p91/p84 | signal transducer and activator of transcription 1 isoform alpha
Type:
Cytosolic Transcription Factor
Mol. Mass.:
87327.69
Organism:
Homo sapiens (Human)
Description:
Stat1 was expressed in sf9 cells from a baculovirus encoding the recombinant proteins. Stat1 dimer binds to DNA.
Residue:
750
  
Inhibitor
Name:
BDBM43546
Synonyms:
7-(methoxymethyl)-3-(2-methoxyphenyl)-1H-[1,2,4]triazolo[4,3-a]pyrimidin-5-one MLS000034831 cid_652810
Type:
Small organic molecule
Emp. Form.:
C14H14N4O3
Mol. Mass.:
286.286
SMILES:
COCc1cc(=O)n2c(n[nH]c2n1)-c1ccccc1OC
: