Target
Signal transducer and activator of transcription 1-alpha/beta
Ligand
BDBM43547
Substrate
Meas. Tech.
Dose response counterscreen assay for STAT3 activators: cell-based high throughput assay to measure STAT1 activation
EC50
>55700±n/a nM
Citation
 PubChem, PC Dose response counterscreen assay for STAT3 activators: cell-based high throughput assay to measure STAT1 activation PubChem Bioassay (2008)[AID] 
Target
Name:
Signal transducer and activator of transcription 1-alpha/beta
Synonyms:
STAT1 Signal transducer and activator of transcription 1-alpha/beta Transcription factor ISGF-3 components p91/p84 | signal transducer and activator of transcription 1 isoform alpha
Type:
Cytosolic Transcription Factor
Mol. Mass.:
87327.69
Organism:
Homo sapiens (Human)
Description:
Stat1 was expressed in sf9 cells from a baculovirus encoding the recombinant proteins. Stat1 dimer binds to DNA.
Residue:
750
  
Inhibitor
Name:
BDBM43547
Synonyms:
(3-Cyano-2-methyl-indol-1-yl)-acetic acid 2-(3-cyano-2-methyl-indol-1-yl)acetic acid 2-(3-cyano-2-methylindol-1-yl)acetic acid SMR000013849 | cid_653215
Type:
Small organic molecule
Emp. Form.:
C12H10N2O2
Mol. Mass.:
214.22
SMILES:
Cc1c(C#N)c2ccccc2n1CC(O)=O
: