Target
Signal transducer and activator of transcription 1-alpha/beta
Ligand
BDBM43550
Substrate
Meas. Tech.
Dose response counterscreen assay for STAT3 activators: cell-based high throughput assay to measure STAT1 activation
EC50
>55700±n/a nM
Citation
 PubChem, PC Dose response counterscreen assay for STAT3 activators: cell-based high throughput assay to measure STAT1 activation PubChem Bioassay (2008)[AID] 
Target
Name:
Signal transducer and activator of transcription 1-alpha/beta
Synonyms:
STAT1 Signal transducer and activator of transcription 1-alpha/beta Transcription factor ISGF-3 components p91/p84 | signal transducer and activator of transcription 1 isoform alpha
Type:
Cytosolic Transcription Factor
Mol. Mass.:
87327.69
Organism:
Homo sapiens (Human)
Description:
Stat1 was expressed in sf9 cells from a baculovirus encoding the recombinant proteins. Stat1 dimer binds to DNA.
Residue:
750
  
Inhibitor
Name:
BDBM43550
Synonyms:
1H-indazole-3-carboxylic acid methyl ester SMR000038274 methyl 1H-indazole-3-carboxylate
Type:
Small organic molecule
Emp. Form.:
C9H8N2O2
Mol. Mass.:
176.172
SMILES:
COC(=O)c1n[nH]c2ccccc12
: