Target
Signal transducer and activator of transcription 1-alpha/beta
Ligand
BDBM30793
Substrate
Meas. Tech.
Dose response counterscreen assay for STAT3 activators: cell-based high throughput assay to measure STAT1 activation
EC50
>55700±n/a nM
Citation
 PubChem, PC Dose response counterscreen assay for STAT3 activators: cell-based high throughput assay to measure STAT1 activation PubChem Bioassay (2008)[AID] 
Target
Name:
Signal transducer and activator of transcription 1-alpha/beta
Synonyms:
STAT1 Signal transducer and activator of transcription 1-alpha/beta Transcription factor ISGF-3 components p91/p84 | signal transducer and activator of transcription 1 isoform alpha
Type:
Cytosolic Transcription Factor
Mol. Mass.:
87327.69
Organism:
Homo sapiens (Human)
Description:
Stat1 was expressed in sf9 cells from a baculovirus encoding the recombinant proteins. Stat1 dimer binds to DNA.
Residue:
750
  
Inhibitor
Name:
BDBM30793
Synonyms:
4-acetyl-N-(2-methoxy-5-methyl-phenyl)-3,5-dimethyl-1H-pyrrole-2-carboxamide 4-ethanoyl-N-(2-methoxy-5-methyl-phenyl)-3,5-dimethyl-1H-pyrrole-2-carboxamide SMR000064037 | cid_867014
Type:
Small organic molecule
Emp. Form.:
C17H20N2O3
Mol. Mass.:
300.3523
SMILES:
COc1ccc(C)cc1NC(=O)c1[nH]c(C)c(C(C)=O)c1C
: