Target
Signal transducer and activator of transcription 1-alpha/beta
Ligand
BDBM43563
Substrate
Meas. Tech.
Dose response counterscreen assay for STAT3 activators: cell-based high throughput assay to measure STAT1 activation
EC50
>55700±n/a nM
Citation
 PubChem, PC Dose response counterscreen assay for STAT3 activators: cell-based high throughput assay to measure STAT1 activation PubChem Bioassay (2008)[AID] 
Target
Name:
Signal transducer and activator of transcription 1-alpha/beta
Synonyms:
STAT1 Signal transducer and activator of transcription 1-alpha/beta Transcription factor ISGF-3 components p91/p84 | signal transducer and activator of transcription 1 isoform alpha
Type:
Cytosolic Transcription Factor
Mol. Mass.:
87327.69
Organism:
Homo sapiens (Human)
Description:
Stat1 was expressed in sf9 cells from a baculovirus encoding the recombinant proteins. Stat1 dimer binds to DNA.
Residue:
750
  
Inhibitor
Name:
BDBM43563
Synonyms:
4-(1,3-benzothiazol-2-ylsulfanyl)-N-(furan-2-ylmethyl)butanamide 4-(1,3-benzothiazol-2-ylthio)-N-(2-furfuryl)butyramide SMR000067389 | cid_2088481
Type:
Small organic molecule
Emp. Form.:
C16H16N2O2S2
Mol. Mass.:
332.44
SMILES:
O=C(CCCSc1nc2ccccc2s1)NCc1ccco1
: