Target
Signal transducer and activator of transcription 1-alpha/beta
Ligand
BDBM40021
Substrate
Meas. Tech.
Dose response counterscreen assay for STAT3 activators: cell-based high throughput assay to measure STAT1 activation
EC50
>55700±n/a nM
Citation
 PubChem, PC Dose response counterscreen assay for STAT3 activators: cell-based high throughput assay to measure STAT1 activation PubChem Bioassay (2008)[AID] 
Target
Name:
Signal transducer and activator of transcription 1-alpha/beta
Synonyms:
STAT1 Signal transducer and activator of transcription 1-alpha/beta Transcription factor ISGF-3 components p91/p84 | signal transducer and activator of transcription 1 isoform alpha
Type:
Cytosolic Transcription Factor
Mol. Mass.:
87327.69
Organism:
Homo sapiens (Human)
Description:
Stat1 was expressed in sf9 cells from a baculovirus encoding the recombinant proteins. Stat1 dimer binds to DNA.
Residue:
750
  
Inhibitor
Name:
BDBM40021
Synonyms:
MLS000092893 N-(5-chloro-2-methoxy-phenyl)-2,4-dimethyl-oxazole-5-carboxamide N-(5-chloro-2-methoxyphenyl)-2,4-dimethyl-5-oxazolecarboxamide cid_3238843
Type:
Small organic molecule
Emp. Form.:
C13H13ClN2O3
Mol. Mass.:
280.707
SMILES:
COc1ccc(Cl)cc1NC(=O)c1oc(C)nc1C
: