Target
Signal transducer and activator of transcription 1-alpha/beta
Ligand
BDBM43567
Substrate
Meas. Tech.
Dose response counterscreen assay for STAT3 activators: cell-based high throughput assay to measure STAT1 activation
EC50
>55700±n/a nM
Citation
 PubChem, PC Dose response counterscreen assay for STAT3 activators: cell-based high throughput assay to measure STAT1 activation PubChem Bioassay (2008)[AID] 
Target
Name:
Signal transducer and activator of transcription 1-alpha/beta
Synonyms:
STAT1 Signal transducer and activator of transcription 1-alpha/beta Transcription factor ISGF-3 components p91/p84 | signal transducer and activator of transcription 1 isoform alpha
Type:
Cytosolic Transcription Factor
Mol. Mass.:
87327.69
Organism:
Homo sapiens (Human)
Description:
Stat1 was expressed in sf9 cells from a baculovirus encoding the recombinant proteins. Stat1 dimer binds to DNA.
Residue:
750
  
Inhibitor
Name:
BDBM43567
Synonyms:
3-(1H-indol-3-yl)-1-keto-N-[3-(2-ketopyrrolidino)propyl]-2-methyl-3,4-dihydroisoquinoline-4-carboxamide 3-(1H-indol-3-yl)-2-methyl-1-oxo-N-[3-(2-oxo-1-pyrrolidinyl)propyl]-3,4-dihydroisoquinoline-4-carboxamide 3-(1H-indol-3-yl)-2-methyl-1-oxo-N-[3-(2-oxopyrrolidin-1-yl)propyl]-3,4-dihydroisoquinoline-4-carboxamide SMR000025489 | cid_3241758
Type:
Small organic molecule
Emp. Form.:
C26H28N4O3
Mol. Mass.:
444.5255
SMILES:
CN1C(C(C(=O)NCCCN2CCCC2=O)c2ccccc2C1=O)c1c[nH]c2ccccc12
: