Target
Signal transducer and activator of transcription 1-alpha/beta
Ligand
BDBM43571
Substrate
Meas. Tech.
Dose response counterscreen assay for STAT3 activators: cell-based high throughput assay to measure STAT1 activation
EC50
>55700±n/a nM
Citation
 PubChem, PC Dose response counterscreen assay for STAT3 activators: cell-based high throughput assay to measure STAT1 activation PubChem Bioassay (2008)[AID] 
Target
Name:
Signal transducer and activator of transcription 1-alpha/beta
Synonyms:
STAT1 Signal transducer and activator of transcription 1-alpha/beta Transcription factor ISGF-3 components p91/p84 | signal transducer and activator of transcription 1 isoform alpha
Type:
Cytosolic Transcription Factor
Mol. Mass.:
87327.69
Organism:
Homo sapiens (Human)
Description:
Stat1 was expressed in sf9 cells from a baculovirus encoding the recombinant proteins. Stat1 dimer binds to DNA.
Residue:
750
  
Inhibitor
Name:
BDBM43571
Synonyms:
2-(4-methoxyphenyl)-6-phenyl-[1,3]thiazolo[3,2-b][1,2,4]triazole 2-(4-methoxyphenyl)-6-phenyl[1,3]thiazolo[3,2-b][1,2,4]triazole MLS000049582 cid_2140141
Type:
Small organic molecule
Emp. Form.:
C17H13N3OS
Mol. Mass.:
307.37
SMILES:
COc1ccc(cc1)-c1nc2scc(-c3ccccc3)n2n1
: