Target
Signal transducer and activator of transcription 1-alpha/beta
Ligand
BDBM40067
Substrate
Meas. Tech.
Dose response counterscreen assay for STAT3 activators: cell-based high throughput assay to measure STAT1 activation
EC50
>55700±n/a nM
Citation
 PubChem, PC Dose response counterscreen assay for STAT3 activators: cell-based high throughput assay to measure STAT1 activation PubChem Bioassay (2008)[AID] 
Target
Name:
Signal transducer and activator of transcription 1-alpha/beta
Synonyms:
STAT1 Signal transducer and activator of transcription 1-alpha/beta Transcription factor ISGF-3 components p91/p84 | signal transducer and activator of transcription 1 isoform alpha
Type:
Cytosolic Transcription Factor
Mol. Mass.:
87327.69
Organism:
Homo sapiens (Human)
Description:
Stat1 was expressed in sf9 cells from a baculovirus encoding the recombinant proteins. Stat1 dimer binds to DNA.
Residue:
750
  
Inhibitor
Name:
BDBM40067
Synonyms:
MLS000062293 N-(2-pyridyl)-2-(2-thienyl)acetamide N-pyridin-2-yl-2-thiophen-2-yl-ethanamide SMR000071109 | cid_836204
Type:
Small organic molecule
Emp. Form.:
C11H10N2OS
Mol. Mass.:
218.275
SMILES:
O=C(Cc1cccs1)Nc1ccccn1
: