Target
Signal transducer and activator of transcription 1-alpha/beta
Ligand
BDBM43573
Substrate
Meas. Tech.
Dose response counterscreen assay for STAT3 activators: cell-based high throughput assay to measure STAT1 activation
EC50
>55700±n/a nM
Citation
 PubChem, PC Dose response counterscreen assay for STAT3 activators: cell-based high throughput assay to measure STAT1 activation PubChem Bioassay (2008)[AID] 
Target
Name:
Signal transducer and activator of transcription 1-alpha/beta
Synonyms:
STAT1 Signal transducer and activator of transcription 1-alpha/beta Transcription factor ISGF-3 components p91/p84 | signal transducer and activator of transcription 1 isoform alpha
Type:
Cytosolic Transcription Factor
Mol. Mass.:
87327.69
Organism:
Homo sapiens (Human)
Description:
Stat1 was expressed in sf9 cells from a baculovirus encoding the recombinant proteins. Stat1 dimer binds to DNA.
Residue:
750
  
Inhibitor
Name:
BDBM43573
Synonyms:
6-({[4-(3,4-dihydro-1(2H)-quinolinylsulfonyl)phenyl]amino}carbonyl)-3-cyclohexene-1-carboxylic acid 6-[[4-(3,4-dihydro-2H-quinolin-1-ylsulfonyl)phenyl]carbamoyl]cyclohex-3-ene-1-carboxylic acid SMR000080802 | cid_2971528
Type:
Small organic molecule
Emp. Form.:
C23H24N2O5S
Mol. Mass.:
440.512
SMILES:
OC(=O)C1CC=CCC1C(=O)Nc1ccc(cc1)S(=O)(=O)N1CCCc2ccccc12
: