Target
Signal transducer and activator of transcription 1-alpha/beta
Ligand
BDBM43574
Substrate
Meas. Tech.
Dose response counterscreen assay for STAT3 activators: cell-based high throughput assay to measure STAT1 activation
EC50
>55700±n/a nM
Citation
 PubChem, PC Dose response counterscreen assay for STAT3 activators: cell-based high throughput assay to measure STAT1 activation PubChem Bioassay (2008)[AID] 
Target
Name:
Signal transducer and activator of transcription 1-alpha/beta
Synonyms:
STAT1 Signal transducer and activator of transcription 1-alpha/beta Transcription factor ISGF-3 components p91/p84 | signal transducer and activator of transcription 1 isoform alpha
Type:
Cytosolic Transcription Factor
Mol. Mass.:
87327.69
Organism:
Homo sapiens (Human)
Description:
Stat1 was expressed in sf9 cells from a baculovirus encoding the recombinant proteins. Stat1 dimer binds to DNA.
Residue:
750
  
Inhibitor
Name:
BDBM43574
Synonyms:
(6E)-3-(3,5-dimethyl-1-pyrazolyl)-6-(3-indolylidene)-5H-[1,2,4]triazolo[3,4-b][1,3,4]thiadiazine 3-(3,5-dimethyl-1H-pyrazol-1-yl)-6-(1H-indol-3-yl)-7H-[1,2,4]triazolo[3,4-b][1,3,4]thiadiazine SMR000081964 | cid_5771731
Type:
Small organic molecule
Emp. Form.:
C17H15N7S
Mol. Mass.:
349.413
SMILES:
Cc1cc(C)n(n1)-c1nnc2SCC(=Nn12)c1c[nH]c2ccccc12
: