Target
Signal transducer and activator of transcription 1-alpha/beta
Ligand
BDBM30930
Substrate
Meas. Tech.
Dose response counterscreen assay for STAT3 activators: cell-based high throughput assay to measure STAT1 activation
EC50
>55700±n/a nM
Citation
 PubChem, PC Dose response counterscreen assay for STAT3 activators: cell-based high throughput assay to measure STAT1 activation PubChem Bioassay (2008)[AID] 
Target
Name:
Signal transducer and activator of transcription 1-alpha/beta
Synonyms:
STAT1 Signal transducer and activator of transcription 1-alpha/beta Transcription factor ISGF-3 components p91/p84 | signal transducer and activator of transcription 1 isoform alpha
Type:
Cytosolic Transcription Factor
Mol. Mass.:
87327.69
Organism:
Homo sapiens (Human)
Description:
Stat1 was expressed in sf9 cells from a baculovirus encoding the recombinant proteins. Stat1 dimer binds to DNA.
Residue:
750
  
Inhibitor
Name:
BDBM30930
Synonyms:
3-(4,5,6,7-tetrahydrobenzothiophene-2-carbonylamino)thiophene-2-carboxylic acid methyl ester MLS000051746 cid_1246875 methyl 3-(4,5,6,7-tetrahydro-1-benzothiophene-2-carbonylamino)thiophene-2-carboxylate | methyl 3-[(4,5,6,7-tetrahydro-1-benzothien-2-ylcarbonyl)amino]-2-thiophenecarboxylate
Type:
Small organic molecule
Emp. Form.:
C15H15NO3S2
Mol. Mass.:
321.415
SMILES:
COC(=O)c1sccc1NC(=O)c1cc2CCCCc2s1
: