Target
Signal transducer and activator of transcription 1-alpha/beta
Ligand
BDBM43576
Substrate
Meas. Tech.
Dose response counterscreen assay for STAT3 activators: cell-based high throughput assay to measure STAT1 activation
EC50
>55700±n/a nM
Citation
 PubChem, PC Dose response counterscreen assay for STAT3 activators: cell-based high throughput assay to measure STAT1 activation PubChem Bioassay (2008)[AID] 
Target
Name:
Signal transducer and activator of transcription 1-alpha/beta
Synonyms:
STAT1 Signal transducer and activator of transcription 1-alpha/beta Transcription factor ISGF-3 components p91/p84 | signal transducer and activator of transcription 1 isoform alpha
Type:
Cytosolic Transcription Factor
Mol. Mass.:
87327.69
Organism:
Homo sapiens (Human)
Description:
Stat1 was expressed in sf9 cells from a baculovirus encoding the recombinant proteins. Stat1 dimer binds to DNA.
Residue:
750
  
Inhibitor
Name:
BDBM43576
Synonyms:
3-(4-chlorophenyl)-N-(3-methoxypropyl)-1-methyl-5-thieno[2,3-c]pyrazolecarboxamide 3-(4-chlorophenyl)-N-(3-methoxypropyl)-1-methylthieno[2,3-c]pyrazole-5-carboxamide SMR000094239 | cid_5307136
Type:
Small organic molecule
Emp. Form.:
C17H18ClN3O2S
Mol. Mass.:
363.862
SMILES:
COCCCNC(=O)c1cc2c(nn(C)c2s1)-c1ccc(Cl)cc1
: