Target
Signal transducer and activator of transcription 1-alpha/beta
Ligand
BDBM43577
Substrate
Meas. Tech.
Dose response counterscreen assay for STAT3 activators: cell-based high throughput assay to measure STAT1 activation
EC50
>55700±n/a nM
Citation
 PubChem, PC Dose response counterscreen assay for STAT3 activators: cell-based high throughput assay to measure STAT1 activation PubChem Bioassay (2008)[AID] 
Target
Name:
Signal transducer and activator of transcription 1-alpha/beta
Synonyms:
STAT1 Signal transducer and activator of transcription 1-alpha/beta Transcription factor ISGF-3 components p91/p84 | signal transducer and activator of transcription 1 isoform alpha
Type:
Cytosolic Transcription Factor
Mol. Mass.:
87327.69
Organism:
Homo sapiens (Human)
Description:
Stat1 was expressed in sf9 cells from a baculovirus encoding the recombinant proteins. Stat1 dimer binds to DNA.
Residue:
750
  
Inhibitor
Name:
BDBM43577
Synonyms:
MLS000116379 N-(4-chloro-2,5-dimethoxy-phenyl)-5-propyl-isoxazole-3-carboxamide N-(4-chloro-2,5-dimethoxyphenyl)-5-propyl-3-isoxazolecarboxamide cid_5307721
Type:
Small organic molecule
Emp. Form.:
C15H17ClN2O4
Mol. Mass.:
324.759
SMILES:
CCCc1cc(no1)C(=O)Nc1cc(OC)c(Cl)cc1OC
: