Target
Signal transducer and activator of transcription 1-alpha/beta
Ligand
BDBM43584
Substrate
Meas. Tech.
Dose response counterscreen assay for STAT3 activators: cell-based high throughput assay to measure STAT1 activation
EC50
>55700±n/a nM
Citation
 PubChem, PC Dose response counterscreen assay for STAT3 activators: cell-based high throughput assay to measure STAT1 activation PubChem Bioassay (2008)[AID] 
Target
Name:
Signal transducer and activator of transcription 1-alpha/beta
Synonyms:
STAT1 Signal transducer and activator of transcription 1-alpha/beta Transcription factor ISGF-3 components p91/p84 | signal transducer and activator of transcription 1 isoform alpha
Type:
Cytosolic Transcription Factor
Mol. Mass.:
87327.69
Organism:
Homo sapiens (Human)
Description:
Stat1 was expressed in sf9 cells from a baculovirus encoding the recombinant proteins. Stat1 dimer binds to DNA.
Residue:
750
  
Inhibitor
Name:
BDBM43584
Synonyms:
2-[(1-methyl-2-benzimidazolyl)methylamino]phenol MLS000116137 cid_873059
Type:
Small organic molecule
Emp. Form.:
C15H15N3O
Mol. Mass.:
253.2991
SMILES:
Cn1c(CNc2ccccc2O)nc2ccccc12
: